Reaction Details
TargetSerine/threonine-protein kinase mTOR
LigandBDBM50320102
Substrate/Competitorn/a
Meas. Tech.ChEMBL_635345 (CHEMBL1119658)
IC50>4000±n/a nM
Citation Zhang, NAyral-Kaloustian, SAnderson, JTNguyen, TDas, SVenkatesan, AMBrooijmans, NLucas, JYu, KHollander, IMallon, R 5-ureidobenzofuranone indoles as potent and efficacious inhibitors of PI3 kinase-alpha and mTOR for the treatment of breast cancer. Bioorg Med Chem Lett20:3526-9 (2010) 
 
Serine/threonine-protein kinase mTOR
Name:Serine/threonine-protein kinase mTOR
Type:Rapamycin target protein
Mol. Mass.:288917.12
Organism:Homo sapiens (Human)
Description:P42345
Residue:2549
BDBM50320102
NameBDBM50320102
Synonyms:1-(2-((5-methoxy-1H-indol-3-yl)methylene)-3-oxo-2,3-dihydrobenzofuran-5-yl)-3-(4-(4-methylpiperazine-1-carbonyl)phenyl)urea | CHEMBL1082622
TypeSmall organic molecule
Emp. Form.C31H29N5O5
Mol. Mass.551.5925
SMILESCOc1ccc2[nH]cc(\C=C3\Oc4ccc(NC(=O)Nc5ccc(cc5)C(=O)N5CCN(C)CC5)cc4C3=O)c2c1