Reaction Details
TargetDipeptidyl peptidase 4
LigandBDBM50320120
Substrate/Competitorn/a
Meas. Tech.ChEMBL_635373 (CHEMBL1119686)
IC50 5±n/a nM
Citation Yeh, TKTsai, TYHsu, TCheng, JHChen, XSong, JSShy, HSChiou, MCChien, CHTseng, YJHuang, CYYeh, KCHuang, YLHuang, CHHuang, YWWang, MHTang, HKChao, YSChen, CTJiaang, WT (2S,4S)-1-[2-(1,1-dimethyl-3-oxo-3-pyrrolidin-1-yl-propylamino)acetyl]-4-fluoro-pyrrolidine-2-carbonitrile: a potent, selective, and orally bioavailable dipeptide-derived inhibitor of dipeptidyl peptidase IV. Bioorg Med Chem Lett20:3596-600 (2010) 
 
Dipeptidyl peptidase 4
Name:Dipeptidyl peptidase 4
Type:Enzyme
Mol. Mass.:88271.01
Organism:Homo sapiens (Human)
Description:P27487
Residue:766
BDBM50320120
NameBDBM50320120
Synonyms:(2S,4S)-4-fluoro-1-(2-(2-methyl-4-oxo-4-(pyrrolidin-1-yl)butan-2-ylamino)acetyl)pyrrolidine-2-carbonitrile | CHEMBL1082462
TypeSmall organic molecule
Emp. Form.C16H25FN4O2
Mol. Mass.324.3937
SMILESCC(C)(CC(=O)N1CCCC1)NCC(=O)N1C[C@@H](F)C[C@H]1C#N