Reaction Details
TargetDipeptidyl peptidase 4
LigandBDBM11695
Substrate/Competitorn/a
Meas. Tech.ChEMBL_635373 (CHEMBL1119686)
IC50 17±n/a nM
Citation Yeh, TKTsai, TYHsu, TCheng, JHChen, XSong, JSShy, HSChiou, MCChien, CHTseng, YJHuang, CYYeh, KCHuang, YLHuang, CHHuang, YWWang, MHTang, HKChao, YSChen, CTJiaang, WT (2S,4S)-1-[2-(1,1-dimethyl-3-oxo-3-pyrrolidin-1-yl-propylamino)acetyl]-4-fluoro-pyrrolidine-2-carbonitrile: a potent, selective, and orally bioavailable dipeptide-derived inhibitor of dipeptidyl peptidase IV. Bioorg Med Chem Lett20:3596-600 (2010) 
 
Dipeptidyl peptidase 4
Name:Dipeptidyl peptidase 4
Type:Enzyme
Mol. Mass.:88271.01
Organism:Homo sapiens (Human)
Description:P27487
Residue:766
BDBM11695
NameBDBM11695
Synonyms:(2S)-1-{2-[(3-hydroxyadamantan-1-yl)amino]acetyl}pyrrolidine-2-carbonitrile NVP-LAF237
TypeSmall organic molecule
Emp. Form.C17H25N3O2
Mol. Mass.303.3993
SMILESOC12CC3CC(C1)CC(C3)(C2)NCC(=O)N1CCC[C@H]1C#N