Reaction Details
TargetDipeptidyl peptidase 2
LigandBDBM11162
Substrate/Competitorn/a
Meas. Tech.ChEMBL_635367 (CHEMBL1119680)
IC50>100000±n/a nM
Citation Yeh, TKTsai, TYHsu, TCheng, JHChen, XSong, JSShy, HSChiou, MCChien, CHTseng, YJHuang, CYYeh, KCHuang, YLHuang, CHHuang, YWWang, MHTang, HKChao, YSChen, CTJiaang, WT (2S,4S)-1-[2-(1,1-dimethyl-3-oxo-3-pyrrolidin-1-yl-propylamino)acetyl]-4-fluoro-pyrrolidine-2-carbonitrile: a potent, selective, and orally bioavailable dipeptide-derived inhibitor of dipeptidyl peptidase IV. Bioorg Med Chem Lett20:3596-600 (2010) 
 
Dipeptidyl peptidase 2
Name:Dipeptidyl peptidase 2
Type:Protein
Mol. Mass.:54339.29
Organism:Homo sapiens (Human)
Description:Q9UHL4
Residue:492
BDBM11162
NameBDBM11162
Synonyms:(1R)-3-oxo-3-[3-(trifluoroethyl)-5,6-dihydro[1,2,4]triazolo[4,3-a]pyrazin-7(8H)-yl]-1-(2,4,5-trifluorobenzyl)propylamine CHEMBL393336 Sitagliptin Triazolopiperazine Analogue 1 | US10479798, Compound MK0431
TypeSmall organic molecule
Emp. Form.C16H15F6N5O
Mol. Mass.407.3136
SMILESN[C@@H](CC(=O)N1CCn2c(C1)nnc2C(F)(F)F)Cc1cc(F)c(F)cc1F