Reaction Details
TargetCannabinoid receptor 2
LigandBDBM50320184
Substrate/Competitorn/a
Meas. Tech.ChEMBL_635413 (CHEMBL1120213)
IC50 4200±n/a nM
Citation Madsen-Duggan, CBDebenham, JSWalsh, TFYan, LHuo, PWang, JTong, XLao, JFong, TMXiao, JCHuang, CRShen, CPStribling, DSShearman, LPStrack, AMGoulet, MTHale, JJ Dihydro-pyrano[2,3-b]pyridines and tetrahydro-1,8-naphthyridines as CB1 receptor inverse agonists: synthesis, SAR and biological evaluation. Bioorg Med Chem Lett20:3750-4 (2010) 
 
Cannabinoid receptor 2
Name:Cannabinoid receptor 2
Type:G Protein-Coupled Receptor (GPCR)
Mol. Mass.:39690.94
Organism:Homo sapiens (Human)
Description:P34972
Residue:360
BDBM50320184
NameBDBM50320184
Synonyms:CHEMBL1086494 | rac-N-(7'-(2-chlorophenyl)-6'-(4-chlorophenyl)-3',4'-dihydrospiro[cyclohexane-1,2'-pyrano[2,3-b]pyridine]-4'-yl)-2-hydroxyacetamide
TypeSmall organic molecule
Emp. Form.C27H26Cl2N2O3
Mol. Mass.497.413
SMILESOCC(=O)NC1CC2(CCCCC2)Oc2nc(-c3ccccc3Cl)c(cc12)-c1ccc(Cl)cc1