Reaction Details
TargetCannabinoid receptor 2
LigandBDBM50320190
Substrate/Competitorn/a
Meas. Tech.ChEMBL_635413 (CHEMBL1120213)
IC50 3790±n/a nM
Citation Madsen-Duggan, CBDebenham, JSWalsh, TFYan, LHuo, PWang, JTong, XLao, JFong, TMXiao, JCHuang, CRShen, CPStribling, DSShearman, LPStrack, AMGoulet, MTHale, JJ Dihydro-pyrano[2,3-b]pyridines and tetrahydro-1,8-naphthyridines as CB1 receptor inverse agonists: synthesis, SAR and biological evaluation. Bioorg Med Chem Lett20:3750-4 (2010) 
 
Cannabinoid receptor 2
Name:Cannabinoid receptor 2
Type:G Protein-Coupled Receptor (GPCR)
Mol. Mass.:39690.94
Organism:Homo sapiens (Human)
Description:P34972
Residue:360
BDBM50320190
NameBDBM50320190
Synonyms:CHEMBL1085259 | rac-6-(4-chlorophenyl)-7-(2,4-dichlorophenyl)-4-methoxy-2,2-dimethyl-3,4-dihydro-2H-pyrano[2,3-b]pyridine
TypeSmall organic molecule
Emp. Form.C23H20Cl3NO2
Mol. Mass.448.769
SMILESCOC1CC(C)(C)Oc2nc(-c3ccc(Cl)cc3Cl)c(cc12)-c1ccc(Cl)cc1