Reaction Details
TargetCannabinoid receptor 2
LigandBDBM50320192
Substrate/Competitorn/a
Meas. Tech.ChEMBL_635413 (CHEMBL1120213)
IC50 1300±n/a nM
Citation Madsen-Duggan, CBDebenham, JSWalsh, TFYan, LHuo, PWang, JTong, XLao, JFong, TMXiao, JCHuang, CRShen, CPStribling, DSShearman, LPStrack, AMGoulet, MTHale, JJ Dihydro-pyrano[2,3-b]pyridines and tetrahydro-1,8-naphthyridines as CB1 receptor inverse agonists: synthesis, SAR and biological evaluation. Bioorg Med Chem Lett20:3750-4 (2010) 
 
Cannabinoid receptor 2
Name:Cannabinoid receptor 2
Type:G Protein-Coupled Receptor (GPCR)
Mol. Mass.:39690.94
Organism:Homo sapiens (Human)
Description:P34972
Residue:360
BDBM50320192
NameBDBM50320192
Synonyms:6-(4-chlorophenyl)-7-(2,4-dichlorophenyl)-2,2-dimethyl-2H-pyrano[2,3-b]pyridin-4(3H)-one | CHEMBL1084039
TypeSmall organic molecule
Emp. Form.C22H16Cl3NO2
Mol. Mass.432.727
SMILESCC1(C)CC(=O)c2cc(-c3ccc(Cl)cc3)c(nc2O1)-c1ccc(Cl)cc1Cl