Reaction Details
TargetCannabinoid receptor 1
LigandBDBM50320199
Substrate/Competitorn/a
Meas. Tech.ChEMBL_635412 (CHEMBL1120212)
IC50 23±n/a nM
Citation Madsen-Duggan, CBDebenham, JSWalsh, TFYan, LHuo, PWang, JTong, XLao, JFong, TMXiao, JCHuang, CRShen, CPStribling, DSShearman, LPStrack, AMGoulet, MTHale, JJ Dihydro-pyrano[2,3-b]pyridines and tetrahydro-1,8-naphthyridines as CB1 receptor inverse agonists: synthesis, SAR and biological evaluation. Bioorg Med Chem Lett20:3750-4 (2010) 
 
Cannabinoid receptor 1
Name:Cannabinoid receptor 1
Type:G Protein-Coupled Receptor (GPCR)
Mol. Mass.:52868.96
Organism:Homo sapiens (Human)
Description:P21554
Residue:472
BDBM50320199
NameBDBM50320199
Synonyms:7'-(2-chlorophenyl)-6'-(4-chlorophenyl)spiro[cyclopentane-1,2'-pyrano[2,3-b]pyridin]-4'(3'H)-one | CHEMBL1084556
TypeSmall organic molecule
Emp. Form.C24H19Cl2NO2
Mol. Mass.424.319
SMILESClc1ccc(cc1)-c1cc2C(=O)CC3(CCCC3)Oc2nc1-c1ccccc1Cl