Reaction Details
TargetCannabinoid receptor 2
LigandBDBM50320200
Substrate/Competitorn/a
Meas. Tech.ChEMBL_635413 (CHEMBL1120213)
IC50 8300±n/a nM
Citation Madsen-Duggan, CBDebenham, JSWalsh, TFYan, LHuo, PWang, JTong, XLao, JFong, TMXiao, JCHuang, CRShen, CPStribling, DSShearman, LPStrack, AMGoulet, MTHale, JJ Dihydro-pyrano[2,3-b]pyridines and tetrahydro-1,8-naphthyridines as CB1 receptor inverse agonists: synthesis, SAR and biological evaluation. Bioorg Med Chem Lett20:3750-4 (2010) 
 
Cannabinoid receptor 2
Name:Cannabinoid receptor 2
Type:G Protein-Coupled Receptor (GPCR)
Mol. Mass.:39690.94
Organism:Homo sapiens (Human)
Description:P34972
Residue:360
BDBM50320200
NameBDBM50320200
Synonyms:7'-(2-chlorophenyl)-6'-(4-chlorophenyl)spiro[cyclohexane-1,2'-pyrano[2,3-b]pyridin]-4'(3'H)-one | CHEMBL1084557
TypeSmall organic molecule
Emp. Form.C25H21Cl2NO2
Mol. Mass.438.346
SMILESClc1ccc(cc1)-c1cc2C(=O)CC3(CCCCC3)Oc2nc1-c1ccccc1Cl