Reaction Details
TargetCannabinoid receptor 2
LigandBDBM50320201
Substrate/Competitorn/a
Meas. Tech.ChEMBL_635413 (CHEMBL1120213)
IC50 8000±n/a nM
Citation Madsen-Duggan, CBDebenham, JSWalsh, TFYan, LHuo, PWang, JTong, XLao, JFong, TMXiao, JCHuang, CRShen, CPStribling, DSShearman, LPStrack, AMGoulet, MTHale, JJ Dihydro-pyrano[2,3-b]pyridines and tetrahydro-1,8-naphthyridines as CB1 receptor inverse agonists: synthesis, SAR and biological evaluation. Bioorg Med Chem Lett20:3750-4 (2010) 
 
Cannabinoid receptor 2
Name:Cannabinoid receptor 2
Type:G Protein-Coupled Receptor (GPCR)
Mol. Mass.:39690.94
Organism:Homo sapiens (Human)
Description:P34972
Residue:360
BDBM50320201
NameBDBM50320201
Synonyms:7-(2-chlorophenyl)-6-(4-chlorophenyl)-2',3',5',6'-tetrahydrospiro[pyrano[2,3-b]pyridine-2,4'-thiopyran]-4(3H)-one | CHEMBL1084558
TypeSmall organic molecule
Emp. Form.C24H19Cl2NO2S
Mol. Mass.456.384
SMILESClc1ccc(cc1)-c1cc2C(=O)CC3(CCSCC3)Oc2nc1-c1ccccc1Cl