Reaction Details
TargetDipeptidyl peptidase 4
LigandBDBM50320290
Substrate/Competitorn/a
Meas. Tech.ChEMBL_635711 (CHEMBL1120109)
IC50 24±n/a nM
Citation Cho, TPLong, YFGang, LZYang, WJun, LHYuan, SGHong, FJLin, WLiang, GDLei, ZJing, LJShen, GAHong, SGDan, WYing, FKe, YPYing, LJun, FTai, MX Synthesis and biological evaluation of azobicyclo[3.3.0] octane derivatives as dipeptidyl peptidase 4 inhibitors for the treatment of type 2 diabetes. Bioorg Med Chem Lett20:3565-8 (2010) 
 
Dipeptidyl peptidase 4
Name:Dipeptidyl peptidase 4
Type:Enzyme
Mol. Mass.:88271.01
Organism:Homo sapiens (Human)
Description:P27487
Residue:766
BDBM50320290
NameBDBM50320290
Synonyms:(3aR,5beta,6aS)-methyl 5-(2-((S)-2-cyanopyrrolidin-1-yl)-2-oxoethylamino)hexahydrocyclopenta[c]pyrrole-2(1H)-carboxylate | CHEMBL1083031
TypeSmall organic molecule
Emp. Form.C16H24N4O3
Mol. Mass.320.3868
SMILESCOC(=O)N1C[C@@H]2C[C@@H](C[C@@H]2C1)NCC(=O)N1CCC[C@H]1C#N