Reaction Details
TargetDipeptidyl peptidase 8
LigandBDBM50320300
Substrate/Competitorn/a
Meas. Tech.ChEMBL_635726 (CHEMBL1120124)
IC50 23±n/a nM
Citation Cho, TPGang, LZLong, YFYang, WQian, WLei, ZJing, LJYing, FKe, YPYing, LJun, F Synthesis and biological evaluation of bicyclo[3.3.0] octane derivatives as dipeptidyl peptidase 4 inhibitors for the treatment of type 2 diabetes. Bioorg Med Chem Lett20:3521-5 (2010) 
 
Dipeptidyl peptidase 8
Name:Dipeptidyl peptidase 8
Type:Enzyme
Mol. Mass.:103342.62
Organism:Homo sapiens (Human)
Description:Q6V1X1
Residue:898
BDBM50320300
NameBDBM50320300
Synonyms:(S)-1-(2-((2alpha,3aR,5S,6aS)-5-methoxyoctahydropentalen-2-ylamino)acetyl)pyrrolidine-2-carbonitrile hydrochloride | CHEMBL1082348
TypeSmall organic molecule
Emp. Form.C16H25N3O2
Mol. Mass.291.3886
SMILESCO[C@@H]1C[C@@H]2C[C@H](C[C@@H]2C1)NCC(=O)N1CCC[C@H]1C#N