Reaction Details
TargetSmoothened homolog
LigandBDBM50320335
Substrate/Competitorn/a
Meas. Tech.ChEMBL_633891 (CHEMBL1120457)
IC50 3.1±n/a nM
Citation Lucas, BSAaron, WAn, SAustin, RJBrown, MChan, HChong, AHungate, RHuang, TJiang, BJohnson, MGKaizerman, JALee, GMcMinn, DLOrf, JPowers, JPRong, MToteva, MMUyeda, CWickramasinghe, DXu, GYe, QZhong, W Design of 1-piperazinyl-4-arylphthalazines as potent Smoothened antagonists. Bioorg Med Chem Lett20:3618-22 (2010) 
 
Smoothened homolog
Name:Smoothened homolog
Type:Protein
Mol. Mass.:86415.51
Organism:Homo sapiens (Human)
Description:Q99835
Residue:787
BDBM50320335
NameBDBM50320335
Synonyms:(R)-4-(4-(4-benzoyl-2-methylpiperazin-1-yl)phthalazin-1-yl)benzonitrile | CHEMBL1084736
TypeSmall organic molecule
Emp. Form.C27H23N5O
Mol. Mass.433.5044
SMILESC[C@@H]1CN(CCN1c1nnc(-c2ccc(cc2)C#N)c2ccccc12)C(=O)c1ccccc1