Reaction Details
Target5-hydroxytryptamine receptor 2A
LigandBDBM50320372
Substrate/Competitorn/a
Meas. Tech.ChEMBL_633900 (CHEMBL1120466)
Ki 0.65±n/a nM
Citation Ladduwahetty, TGilligan, MHumphries, AMerchant, KJFish, RMcAlister, GIvarsson, MDominguez, MO'Connor, DMacLeod, AM Non-basic ligands for aminergic GPCRs: the discovery and development diaryl sulfones as selective, orally bioavailable 5-HT2A receptor antagonists for the treatment of sleep disorders. Bioorg Med Chem Lett20:3708-12 (2010) 
 
5-hydroxytryptamine receptor 2A
Name:5-hydroxytryptamine receptor 2A
Type:undefined
Mol. Mass.:52607.65
Organism:Homo sapiens (Human)
Description:P28223
Residue:471
BDBM50320372
NameBDBM50320372
Synonyms:(E)-2-(4-(2,4-difluorostyryl)phenylsulfonyl)benzamide | CHEMBL1083416
TypeSmall organic molecule
Emp. Form.C21H15F2NO3S
Mol. Mass.399.411
SMILESNC(=O)c1ccccc1S(=O)(=O)c1ccc(\C=C\c2ccc(F)cc2F)cc1