Reaction Details
TargetMatrix metalloproteinase-9
LigandBDBM50320442
Substrate/Competitorn/a
Meas. Tech.ChEMBL_634123 (CHEMBL1119130)
IC50 1230±n/a nM
Citation Kolodziej, SAHockerman, SLDeCrescenzo, GAMcDonald, JJMischke, DAMunie, GEFletcher, TRStehle, NSwearingen, CBecker, DP MMP-13 selective isonipecotamide alpha-sulfone hydroxamates. Bioorg Med Chem Lett20:3561-4 (2010) 
 
Matrix metalloproteinase-9
Name:Matrix metalloproteinase-9
Type:Enzyme
Mol. Mass.:78452.28
Organism:Homo sapiens (Human)
Description:P14780
Residue:707
BDBM50320442
NameBDBM50320442
Synonyms:CHEMBL1085257 | N-hydroxy-1-(2-methoxyethyl)-4-(4-(4-(phenylcarbamoyl)piperidin-1-yl)phenylsulfonyl)piperidine-4-carboxamide
TypeSmall organic molecule
Emp. Form.C27H36N4O6S
Mol. Mass.544.663
SMILESCOCCN1CCC(CC1)(C(=O)NO)S(=O)(=O)c1ccc(cc1)N1CCC(CC1)C(=O)Nc1ccccc1