Reaction Details
Target72 kDa type IV collagenase
LigandBDBM50320421
Substrate/Competitorn/a
Meas. Tech.ChEMBL_634117 (CHEMBL1119124)
IC50 3500±n/a nM
Citation Kolodziej, SAHockerman, SLDeCrescenzo, GAMcDonald, JJMischke, DAMunie, GEFletcher, TRStehle, NSwearingen, CBecker, DP MMP-13 selective isonipecotamide alpha-sulfone hydroxamates. Bioorg Med Chem Lett20:3561-4 (2010) 
 
72 kDa type IV collagenase
Name:72 kDa type IV collagenase
Type:Enzyme
Mol. Mass.:73870.36
Organism:Homo sapiens (Human)
Description: P08253
Residue:660
BDBM50320421
NameBDBM50320421
Synonyms:CHEMBL1083337 | N-benzyl-1-(4-(1-cyclopropyl-4-(hydroxycarbamoyl)piperidin-4-ylsulfonyl)phenyl)-N-methylpiperidine-4-carboxamide
TypeSmall organic molecule
Emp. Form.C29H38N4O5S
Mol. Mass.554.701
SMILESCN(Cc1ccccc1)C(=O)C1CCN(CC1)c1ccc(cc1)S(=O)(=O)C1(CCN(CC1)C1CC1)C(=O)NO