Reaction Details
Target72 kDa type IV collagenase
LigandBDBM50320437
Substrate/Competitorn/a
Meas. Tech.ChEMBL_634117 (CHEMBL1119124)
IC50 5600±n/a nM
Citation Kolodziej, SAHockerman, SLDeCrescenzo, GAMcDonald, JJMischke, DAMunie, GEFletcher, TRStehle, NSwearingen, CBecker, DP MMP-13 selective isonipecotamide alpha-sulfone hydroxamates. Bioorg Med Chem Lett20:3561-4 (2010) 
 
72 kDa type IV collagenase
Name:72 kDa type IV collagenase
Type:Enzyme
Mol. Mass.:73870.36
Organism:Homo sapiens (Human)
Description: P08253
Residue:660
BDBM50320437
NameBDBM50320437
Synonyms:4-(4-(4-(4-(2,4-dimethylphenyl)piperazine-1-carbonyl)piperidin-1-yl)phenylsulfonyl)-N-hydroxytetrahydro-2H-pyran-4-carboxamide | CHEMBL1083586
TypeSmall organic molecule
Emp. Form.C30H40N4O6S
Mol. Mass.584.727
SMILESCc1ccc(N2CCN(CC2)C(=O)C2CCN(CC2)c2ccc(cc2)S(=O)(=O)C2(CCOCC2)C(=O)NO)c(C)c1