Reaction Details
Target72 kDa type IV collagenase
LigandBDBM50320441
Substrate/Competitorn/a
Meas. Tech.ChEMBL_634117 (CHEMBL1119124)
IC50 900±n/a nM
Citation Kolodziej, SAHockerman, SLDeCrescenzo, GAMcDonald, JJMischke, DAMunie, GEFletcher, TRStehle, NSwearingen, CBecker, DP MMP-13 selective isonipecotamide alpha-sulfone hydroxamates. Bioorg Med Chem Lett20:3561-4 (2010) 
 
72 kDa type IV collagenase
Name:72 kDa type IV collagenase
Type:Enzyme
Mol. Mass.:73870.36
Organism:Homo sapiens (Human)
Description: P08253
Residue:660
BDBM50320441
NameBDBM50320441
Synonyms:CHEMBL1082645 | N-hydroxy-4-(4-(4-(4-(pyrazin-2-yl)piperazine-1-carbonyl)piperidin-1-yl)phenylsulfonyl)tetrahydro-2H-pyran-4-carboxamide
TypeSmall organic molecule
Emp. Form.C26H34N6O6S
Mol. Mass.558.65
SMILESONC(=O)C1(CCOCC1)S(=O)(=O)c1ccc(cc1)N1CCC(CC1)C(=O)N1CCN(CC1)c1cnccn1