Reaction Details
TargetCollagenase 3
LigandBDBM50320435
Substrate/Competitorn/a
Meas. Tech.ChEMBL_634118 (CHEMBL1119125)
IC50 6±n/a nM
Citation Kolodziej, SAHockerman, SLDeCrescenzo, GAMcDonald, JJMischke, DAMunie, GEFletcher, TRStehle, NSwearingen, CBecker, DP MMP-13 selective isonipecotamide alpha-sulfone hydroxamates. Bioorg Med Chem Lett20:3561-4 (2010) 
 
Collagenase 3
Name:Collagenase 3
Type:Enzyme
Mol. Mass.:53808.06
Organism:Homo sapiens (Human)
Description:P45452
Residue:471
BDBM50320435
NameBDBM50320435
Synonyms:4-(4-(4-(4-(4-fluorophenyl)piperazine-1-carbonyl)piperidin-1-yl)phenylsulfonyl)-N-hydroxytetrahydro-2H-pyran-4-carboxamide | CHEMBL1085787
TypeSmall organic molecule
Emp. Form.C28H35FN4O6S
Mol. Mass.574.664
SMILESONC(=O)C1(CCOCC1)S(=O)(=O)c1ccc(cc1)N1CCC(CC1)C(=O)N1CCN(CC1)c1ccc(F)cc1