Reaction Details
Target72 kDa type IV collagenase
LigandBDBM50320444
Substrate/Competitorn/a
Meas. Tech.ChEMBL_634117 (CHEMBL1119124)
IC50 6350±n/a nM
Citation Kolodziej, SAHockerman, SLDeCrescenzo, GAMcDonald, JJMischke, DAMunie, GEFletcher, TRStehle, NSwearingen, CBecker, DP MMP-13 selective isonipecotamide alpha-sulfone hydroxamates. Bioorg Med Chem Lett20:3561-4 (2010) 
 
72 kDa type IV collagenase
Name:72 kDa type IV collagenase
Type:Enzyme
Mol. Mass.:73870.36
Organism:Homo sapiens (Human)
Description: P08253
Residue:660
BDBM50320444
NameBDBM50320444
Synonyms:1-cyclopropyl-4-(4-(4-(4-(2,3-dimethylphenyl)piperazine-1-carbonyl)piperidin-1-yl)phenylsulfonyl)-N-hydroxypiperidine-4-carboxamide | CHEMBL1082318
TypeSmall organic molecule
Emp. Form.C33H45N5O5S
Mol. Mass.623.806
SMILESCc1cccc(N2CCN(CC2)C(=O)C2CCN(CC2)c2ccc(cc2)S(=O)(=O)C2(CCN(CC2)C2CC2)C(=O)NO)c1C