Reaction Details
TargetInterstitial collagenase
LigandBDBM50320445
Substrate/Competitorn/a
Meas. Tech.ChEMBL_634119 (CHEMBL1119126)
IC50>10000±n/a nM
Citation Kolodziej, SAHockerman, SLDeCrescenzo, GAMcDonald, JJMischke, DAMunie, GEFletcher, TRStehle, NSwearingen, CBecker, DP MMP-13 selective isonipecotamide alpha-sulfone hydroxamates. Bioorg Med Chem Lett20:3561-4 (2010) 
 
Interstitial collagenase
Name:Interstitial collagenase
Type:Enzyme
Mol. Mass.:54010.26
Organism:Homo sapiens (Human)
Description: P03956
Residue:469
BDBM50320445
NameBDBM50320445
Synonyms:4-(4-(4-(4-(2,3-dimethylphenyl)piperazine-1-carbonyl)piperidin-1-yl)phenylsulfonyl)-N-hydroxy-1-(2-methoxyethyl)piperidine-4-carboxamide | CHEMBL1082319
TypeSmall organic molecule
Emp. Form.C33H47N5O6S
Mol. Mass.641.821
SMILESCOCCN1CCC(CC1)(C(=O)NO)S(=O)(=O)c1ccc(cc1)N1CCC(CC1)C(=O)N1CCN(CC1)c1cccc(C)c1C