Reaction Details
TargetUrotensin-2 receptor
LigandBDBM50302272
Substrate/Competitorn/a
Meas. Tech.ChEMBL_636747 (CHEMBL1167036)
IC50 17±n/a nM
Citation Maryanoff, BEKinney, WA Urotensin-II receptor modulators as potential drugs. J Med Chem53:2695-708 (2010) 
 
Urotensin-2 receptor
Name:Urotensin-2 receptor
Type:Enzyme Catalytic Domain
Mol. Mass.:42725.34
Organism:RAT
Description:Urotensin-II UTS2R RAT::P49684
Residue:386
BDBM50302272
NameBDBM50302272
Synonyms:1-(2-(4-benzyl-4-hydroxypiperidin-1-yl)ethyl)-3-(2-methylquinolin-4-yl)urea CHEMBL1164032 | CHEMBL567303
TypeSmall organic molecule
Emp. Form.C25H30N4O2
Mol. Mass.418.5313
SMILESCc1cc(NC(=O)NCCN2CCC(O)(Cc3ccccc3)CC2)c2ccccc2n1