Reaction Details
TargetUrotensin-2 receptor
LigandBDBM50240963
Substrate/Competitorn/a
Meas. Tech.ChEMBL_636751 (CHEMBL1167040)
Ki 3.2±n/a nM
Citation Maryanoff, BEKinney, WA Urotensin-II receptor modulators as potential drugs. J Med Chem53:2695-708 (2010) 
 
Urotensin-2 receptor
Name:Urotensin-2 receptor
Type:Enzyme Catalytic Domain
Mol. Mass.:42725.34
Organism:RAT
Description:Urotensin-II UTS2R RAT::P49684
Residue:386
BDBM50240963
NameBDBM50240963
Synonyms:(S)-3,4-dichloro-N-(1-(4-(3-(dimethylamino)propoxy)benzyl)pyrrolidin-3-yl)benzamide 3,4-Dichloro-N-{(S)-1-[4-(3-dimethylamino-propoxy)-benzyl]-pyrrolidin-3-yl}-benzamide SB-436811
TypeSmall organic molecule
Emp. Form.C23H29Cl2N3O2
Mol. Mass.450.401
SMILESCN(C)CCCOc1ccc(CN2CC[C@@H](C2)NC(=O)c2ccc(Cl)c(Cl)c2)cc1