Reaction Details
TargetCarbonic anhydrase 12
LigandBDBM50320505
Substrate/Competitorn/a
Meas. Tech.ChEMBL_637718 (CHEMBL1167309)
Ki 5.8±n/a nM
Citation Brzozowski, ZSlawinski, JSaczewski, FInnocenti, ASupuran, CT Carbonic anhydrase inhibitors: synthesis and inhibition of the human cytosolic isozymes I and II and transmembrane isozymes IX, XII (cancer-associated) and XIV with 4-substituted 3-pyridinesulfonamides. Eur J Med Chem45:2396-404 (2010) 
 
Carbonic anhydrase 12
Name:Carbonic anhydrase 12
Type:Enzyme
Mol. Mass.:39456.00
Organism:Homo sapiens (Human)
Description:Catalytic domain of human cloned isozyme was used in the assay
Residue:354
BDBM50320505
NameBDBM50320505
Synonyms:4-Methoxy-3-pyridinesulfonamide | CHEMBL1165321
TypeSmall organic molecule
Emp. Form.C6H8N2O3S
Mol. Mass.188.204
SMILESCOc1ccncc1S(N)(=O)=O