Reaction Details
TargetCarbonic anhydrase 9
LigandBDBM50320510
Substrate/Competitorn/a
Meas. Tech.ChEMBL_637717 (CHEMBL1167308)
Ki 4.9±n/a nM
Citation Brzozowski, ZSlawinski, JSaczewski, FInnocenti, ASupuran, CT Carbonic anhydrase inhibitors: synthesis and inhibition of the human cytosolic isozymes I and II and transmembrane isozymes IX, XII (cancer-associated) and XIV with 4-substituted 3-pyridinesulfonamides. Eur J Med Chem45:2396-404 (2010) 
 
Carbonic anhydrase 9
Name:Carbonic anhydrase 9
Type:Enzyme
Mol. Mass.:49669.03
Organism:Homo sapiens (Human)
Description:Catalytic domain of human cloned isozyme was used in the assay
Residue:459
BDBM50320510
NameBDBM50320510
Synonyms:4-Hydrazino-3-pyridinesulfonamide | CHEMBL1164967
TypeSmall organic molecule
Emp. Form.C5H8N4O2S
Mol. Mass.188.208
SMILESNNc1ccncc1S(N)(=O)=O