Reaction Details
TargetCarbonic anhydrase 9
LigandBDBM50320514
Substrate/Competitorn/a
Meas. Tech.ChEMBL_637717 (CHEMBL1167308)
Ki 11.8±n/a nM
Citation Brzozowski, ZSlawinski, JSaczewski, FInnocenti, ASupuran, CT Carbonic anhydrase inhibitors: synthesis and inhibition of the human cytosolic isozymes I and II and transmembrane isozymes IX, XII (cancer-associated) and XIV with 4-substituted 3-pyridinesulfonamides. Eur J Med Chem45:2396-404 (2010) 
 
Carbonic anhydrase 9
Name:Carbonic anhydrase 9
Type:Enzyme
Mol. Mass.:49669.03
Organism:Homo sapiens (Human)
Description:Catalytic domain of human cloned isozyme was used in the assay
Residue:459
BDBM50320514
NameBDBM50320514
Synonyms:4-(Carbamolymethylthio)pyridine-3-sulfonamide | CHEMBL1163376
TypeSmall organic molecule
Emp. Form.C7H9N3O3S2
Mol. Mass.247.295
SMILESNC(=O)CSc1ccncc1S(N)(=O)=O