Reaction Details
TargetCarbonic anhydrase 9
LigandBDBM50320515
Substrate/Competitorn/a
Meas. Tech.ChEMBL_637717 (CHEMBL1167308)
Ki 30.4±n/a nM
Citation Brzozowski, ZSlawinski, JSaczewski, FInnocenti, ASupuran, CT Carbonic anhydrase inhibitors: synthesis and inhibition of the human cytosolic isozymes I and II and transmembrane isozymes IX, XII (cancer-associated) and XIV with 4-substituted 3-pyridinesulfonamides. Eur J Med Chem45:2396-404 (2010) 
 
Carbonic anhydrase 9
Name:Carbonic anhydrase 9
Type:Enzyme
Mol. Mass.:49669.03
Organism:Homo sapiens (Human)
Description:Catalytic domain of human cloned isozyme was used in the assay
Residue:459
BDBM50320515
NameBDBM50320515
Synonyms:4-Benzythiopyridine-3-sulfonamide | CHEMBL1164472
TypeSmall organic molecule
Emp. Form.C12H12N2O2S2
Mol. Mass.280.366
SMILESNS(=O)(=O)c1cnccc1SCc1ccccc1