Reaction Details
TargetCarbonic anhydrase 9
LigandBDBM50320499
Substrate/Competitorn/a
Meas. Tech.ChEMBL_637717 (CHEMBL1167308)
Ki 7.5±n/a nM
Citation Brzozowski, ZSlawinski, JSaczewski, FInnocenti, ASupuran, CT Carbonic anhydrase inhibitors: synthesis and inhibition of the human cytosolic isozymes I and II and transmembrane isozymes IX, XII (cancer-associated) and XIV with 4-substituted 3-pyridinesulfonamides. Eur J Med Chem45:2396-404 (2010) 
 
Carbonic anhydrase 9
Name:Carbonic anhydrase 9
Type:Enzyme
Mol. Mass.:49669.03
Organism:Homo sapiens (Human)
Description:Catalytic domain of human cloned isozyme was used in the assay
Residue:459
BDBM50320499
NameBDBM50320499
Synonyms:4-(N-Oxide-2-pyridylthio)pyridine-3-sulfonamide | CHEMBL1165118
TypeSmall organic molecule
Emp. Form.C10H9N3O3S2
Mol. Mass.283.327
SMILESNS(=O)(=O)c1cnccc1Sc1cccc[n+]1[O-]