Reaction Details
TargetCarbonic anhydrase 2
LigandBDBM50320516
Substrate/Competitorn/a
Meas. Tech.ChEMBL_637716 (CHEMBL1167307)
Ki 108±n/a nM
Citation Brzozowski, ZSlawinski, JSaczewski, FInnocenti, ASupuran, CT Carbonic anhydrase inhibitors: synthesis and inhibition of the human cytosolic isozymes I and II and transmembrane isozymes IX, XII (cancer-associated) and XIV with 4-substituted 3-pyridinesulfonamides. Eur J Med Chem45:2396-404 (2010) 
 
Carbonic anhydrase 2
Name:Carbonic anhydrase 2
Type:Enzyme
Mol. Mass.:29250.71
Organism:Homo sapiens (Human)
Description:P00918
Residue:260
BDBM50320516
NameBDBM50320516
Synonyms:4-(2-Propynylthio)pyridine-3-sulfonamide | CHEMBL1164486
TypeSmall organic molecule
Emp. Form.C8H8N2O2S2
Mol. Mass.228.291
SMILESNS(=O)(=O)c1cnccc1SCC#C