Reaction Details
TargetCarbonic anhydrase 2
LigandBDBM50320517
Substrate/Competitorn/a
Meas. Tech.ChEMBL_637716 (CHEMBL1167307)
Ki 91.1±n/a nM
Citation Brzozowski, ZSlawinski, JSaczewski, FInnocenti, ASupuran, CT Carbonic anhydrase inhibitors: synthesis and inhibition of the human cytosolic isozymes I and II and transmembrane isozymes IX, XII (cancer-associated) and XIV with 4-substituted 3-pyridinesulfonamides. Eur J Med Chem45:2396-404 (2010) 
 
Carbonic anhydrase 2
Name:Carbonic anhydrase 2
Type:Enzyme
Mol. Mass.:29250.71
Organism:Homo sapiens (Human)
Description:P00918
Residue:260
BDBM50320517
NameBDBM50320517
Synonyms:4-(Cyanomethylthio)pyridine-3-sulfonamide | CHEMBL1164420
TypeSmall organic molecule
Emp. Form.C7H7N3O2S2
Mol. Mass.229.279
SMILESNS(=O)(=O)c1cnccc1SCC#N