Reaction Details
TargetCarbonic anhydrase 2
LigandBDBM50320520
Substrate/Competitorn/a
Meas. Tech.ChEMBL_637716 (CHEMBL1167307)
Ki 94.8±n/a nM
Citation Brzozowski, ZSlawinski, JSaczewski, FInnocenti, ASupuran, CT Carbonic anhydrase inhibitors: synthesis and inhibition of the human cytosolic isozymes I and II and transmembrane isozymes IX, XII (cancer-associated) and XIV with 4-substituted 3-pyridinesulfonamides. Eur J Med Chem45:2396-404 (2010) 
 
Carbonic anhydrase 2
Name:Carbonic anhydrase 2
Type:Enzyme
Mol. Mass.:29250.71
Organism:Homo sapiens (Human)
Description:P00918
Residue:260
BDBM50320520
NameBDBM50320520
Synonyms:4-(6-Nitrobenzothiazol-2-ylthio)pyridine-3-sulfonamide | CHEMBL1163951
TypeSmall organic molecule
Emp. Form.C12H8N4O4S3
Mol. Mass.368.411
SMILESNS(=O)(=O)c1cnccc1Sc1nc2ccc(cc2s1)[N+]([O-])=O