Reaction Details
TargetCarbonic anhydrase 2
LigandBDBM50320499
Substrate/Competitorn/a
Meas. Tech.ChEMBL_637716 (CHEMBL1167307)
Ki 84.5±n/a nM
Citation Brzozowski, ZSlawinski, JSaczewski, FInnocenti, ASupuran, CT Carbonic anhydrase inhibitors: synthesis and inhibition of the human cytosolic isozymes I and II and transmembrane isozymes IX, XII (cancer-associated) and XIV with 4-substituted 3-pyridinesulfonamides. Eur J Med Chem45:2396-404 (2010) 
 
Carbonic anhydrase 2
Name:Carbonic anhydrase 2
Type:Enzyme
Mol. Mass.:29250.71
Organism:Homo sapiens (Human)
Description:P00918
Residue:260
BDBM50320499
NameBDBM50320499
Synonyms:4-(N-Oxide-2-pyridylthio)pyridine-3-sulfonamide | CHEMBL1165118
TypeSmall organic molecule
Emp. Form.C10H9N3O3S2
Mol. Mass.283.327
SMILESNS(=O)(=O)c1cnccc1Sc1cccc[n+]1[O-]