Reaction Details
TargetCarbonic anhydrase 1
LigandBDBM50320511
Substrate/Competitorn/a
Meas. Tech.ChEMBL_637715 (CHEMBL1167306)
Ki 5620±n/a nM
Citation Brzozowski, ZSlawinski, JSaczewski, FInnocenti, ASupuran, CT Carbonic anhydrase inhibitors: synthesis and inhibition of the human cytosolic isozymes I and II and transmembrane isozymes IX, XII (cancer-associated) and XIV with 4-substituted 3-pyridinesulfonamides. Eur J Med Chem45:2396-404 (2010) 
 
Carbonic anhydrase 1
Name:Carbonic anhydrase 1
Type:Enzyme
Mol. Mass.:28873.37
Organism:Homo sapiens (Human)
Description:P00915
Residue:261
BDBM50320511
NameBDBM50320511
Synonyms:4-(Methylhydrazino)-3-pyridinesulfonamide | CHEMBL1164878
TypeSmall organic molecule
Emp. Form.C6H10N4O2S
Mol. Mass.202.234
SMILESCNNc1ccncc1S(N)(=O)=O