Reaction Details
TargetCarbonic anhydrase 1
LigandBDBM50320517
Substrate/Competitorn/a
Meas. Tech.ChEMBL_637715 (CHEMBL1167306)
Ki 11710±n/a nM
Citation Brzozowski, ZSlawinski, JSaczewski, FInnocenti, ASupuran, CT Carbonic anhydrase inhibitors: synthesis and inhibition of the human cytosolic isozymes I and II and transmembrane isozymes IX, XII (cancer-associated) and XIV with 4-substituted 3-pyridinesulfonamides. Eur J Med Chem45:2396-404 (2010) 
 
Carbonic anhydrase 1
Name:Carbonic anhydrase 1
Type:Enzyme
Mol. Mass.:28873.37
Organism:Homo sapiens (Human)
Description:P00915
Residue:261
BDBM50320517
NameBDBM50320517
Synonyms:4-(Cyanomethylthio)pyridine-3-sulfonamide | CHEMBL1164420
TypeSmall organic molecule
Emp. Form.C7H7N3O2S2
Mol. Mass.229.279
SMILESNS(=O)(=O)c1cnccc1SCC#N