Reaction Details
TargetCarbonic anhydrase 1
LigandBDBM50320501
Substrate/Competitorn/a
Meas. Tech.ChEMBL_637715 (CHEMBL1167306)
Ki 10320±n/a nM
Citation Brzozowski, ZSlawinski, JSaczewski, FInnocenti, ASupuran, CT Carbonic anhydrase inhibitors: synthesis and inhibition of the human cytosolic isozymes I and II and transmembrane isozymes IX, XII (cancer-associated) and XIV with 4-substituted 3-pyridinesulfonamides. Eur J Med Chem45:2396-404 (2010) 
 
Carbonic anhydrase 1
Name:Carbonic anhydrase 1
Type:Enzyme
Mol. Mass.:28873.37
Organism:Homo sapiens (Human)
Description:P00915
Residue:261
BDBM50320501
NameBDBM50320501
Synonyms:4-(Quinolinoxy)-3-pyridinesulfonamide | CHEMBL1165726
TypeSmall organic molecule
Emp. Form.C14H11N3O3S
Mol. Mass.301.32
SMILESNS(=O)(=O)c1cnccc1Oc1cccc2cccnc12