Reaction Details
TargetCarbonic anhydrase 1
LigandBDBM50320503
Substrate/Competitorn/a
Meas. Tech.ChEMBL_637715 (CHEMBL1167306)
Ki 6640±n/a nM
Citation Brzozowski, ZSlawinski, JSaczewski, FInnocenti, ASupuran, CT Carbonic anhydrase inhibitors: synthesis and inhibition of the human cytosolic isozymes I and II and transmembrane isozymes IX, XII (cancer-associated) and XIV with 4-substituted 3-pyridinesulfonamides. Eur J Med Chem45:2396-404 (2010) 
 
Carbonic anhydrase 1
Name:Carbonic anhydrase 1
Type:Enzyme
Mol. Mass.:28873.37
Organism:Homo sapiens (Human)
Description:P00915
Residue:261
BDBM50320503
NameBDBM50320503
Synonyms:4-(4-Cyanophenoxy)-3-pyridinesulfonamide | CHEMBL1164572
TypeSmall organic molecule
Emp. Form.C12H9N3O3S
Mol. Mass.275.283
SMILESNS(=O)(=O)c1cnccc1Oc1ccc(cc1)C#N