Reaction Details
TargetCarbonic anhydrase 1
LigandBDBM50320504
Substrate/Competitorn/a
Meas. Tech.ChEMBL_637715 (CHEMBL1167306)
Ki 6100±n/a nM
Citation Brzozowski, ZSlawinski, JSaczewski, FInnocenti, ASupuran, CT Carbonic anhydrase inhibitors: synthesis and inhibition of the human cytosolic isozymes I and II and transmembrane isozymes IX, XII (cancer-associated) and XIV with 4-substituted 3-pyridinesulfonamides. Eur J Med Chem45:2396-404 (2010) 
 
Carbonic anhydrase 1
Name:Carbonic anhydrase 1
Type:Enzyme
Mol. Mass.:28873.37
Organism:Homo sapiens (Human)
Description:P00915
Residue:261
BDBM50320504
NameBDBM50320504
Synonyms:4-Ethoxy-3-pyridinesulfonamide | CHEMBL1165319
TypeSmall organic molecule
Emp. Form.C7H10N2O3S
Mol. Mass.202.231
SMILESCCOc1ccncc1S(N)(=O)=O