Reaction Details
TargetCarbonic anhydrase 14
LigandBDBM50320506
Substrate/Competitorn/a
Meas. Tech.ChEMBL_637719 (CHEMBL1167310)
Ki 83.7±n/a nM
Citation Brzozowski, ZSlawinski, JSaczewski, FInnocenti, ASupuran, CT Carbonic anhydrase inhibitors: synthesis and inhibition of the human cytosolic isozymes I and II and transmembrane isozymes IX, XII (cancer-associated) and XIV with 4-substituted 3-pyridinesulfonamides. Eur J Med Chem45:2396-404 (2010) 
 
Carbonic anhydrase 14
Name:Carbonic anhydrase 14
Type:Enzyme
Mol. Mass.:37665.67
Organism:Homo sapiens (Human)
Description:Human (cloned) isozyme.
Residue:337
BDBM50320506
NameBDBM50320506
Synonyms:4-[N'-(1,1-Dioxopyrido[4,3-e]-1,4,2-dithiazin-3-yl)hydrazino]-3-pyridinesulfonamide | CHEMBL1165695
TypeSmall organic molecule
Emp. Form.C11H10N6O4S3
Mol. Mass.386.43
SMILESNS(=O)(=O)c1cnccc1NN=C1NS(=O)(=O)c2cnccc2S1