Reaction Details
TargetCarbonic anhydrase 12
LigandBDBM50320516
Substrate/Competitorn/a
Meas. Tech.ChEMBL_637718 (CHEMBL1167309)
Ki 15.6±n/a nM
Citation Brzozowski, ZSlawinski, JSaczewski, FInnocenti, ASupuran, CT Carbonic anhydrase inhibitors: synthesis and inhibition of the human cytosolic isozymes I and II and transmembrane isozymes IX, XII (cancer-associated) and XIV with 4-substituted 3-pyridinesulfonamides. Eur J Med Chem45:2396-404 (2010) 
 
Carbonic anhydrase 12
Name:Carbonic anhydrase 12
Type:Enzyme
Mol. Mass.:39456.00
Organism:Homo sapiens (Human)
Description:Catalytic domain of human cloned isozyme was used in the assay
Residue:354
BDBM50320516
NameBDBM50320516
Synonyms:4-(2-Propynylthio)pyridine-3-sulfonamide | CHEMBL1164486
TypeSmall organic molecule
Emp. Form.C8H8N2O2S2
Mol. Mass.228.291
SMILESNS(=O)(=O)c1cnccc1SCC#C