Reaction Details
TargetCarbonic anhydrase 14
LigandBDBM10880
Substrate/Competitorn/a
Meas. Tech.ChEMBL_637719 (CHEMBL1167310)
Ki 41±n/a nM
Citation Brzozowski, ZSlawinski, JSaczewski, FInnocenti, ASupuran, CT Carbonic anhydrase inhibitors: synthesis and inhibition of the human cytosolic isozymes I and II and transmembrane isozymes IX, XII (cancer-associated) and XIV with 4-substituted 3-pyridinesulfonamides. Eur J Med Chem45:2396-404 (2010) 
 
Carbonic anhydrase 14
Name:Carbonic anhydrase 14
Type:Enzyme
Mol. Mass.:37665.67
Organism:Homo sapiens (Human)
Description:Human (cloned) isozyme.
Residue:337
BDBM10880
NameBDBM10880
Synonyms:AZA AZM acetazolamide Acetazolamide Acetazolamide (AZA) Acetazolamide, 5 Acetazolamide, AZA CHEMBL20 Sulfonamide, 1 US11278534, Example acetazolamide sulfonamide 1
TypeSmall organic molecule
Emp. Form.C4H6N4O3S2
Mol. Mass.222.245
SMILESCC(=O)Nc1nnc(s1)S(N)(=O)=O