Reaction Details
TargetCarbonic anhydrase 14
LigandBDBM50320500
Substrate/Competitorn/a
Meas. Tech.ChEMBL_637719 (CHEMBL1167310)
Ki 70±n/a nM
Citation Brzozowski, ZSlawinski, JSaczewski, FInnocenti, ASupuran, CT Carbonic anhydrase inhibitors: synthesis and inhibition of the human cytosolic isozymes I and II and transmembrane isozymes IX, XII (cancer-associated) and XIV with 4-substituted 3-pyridinesulfonamides. Eur J Med Chem45:2396-404 (2010) 
 
Carbonic anhydrase 14
Name:Carbonic anhydrase 14
Type:Enzyme
Mol. Mass.:37665.67
Organism:Homo sapiens (Human)
Description:Human (cloned) isozyme.
Residue:337
BDBM50320500
NameBDBM50320500
Synonyms:4-(2-Methyl-8-quinolinoxy)-3-pyridinesulfonamide | CHEMBL1165071
TypeSmall organic molecule
Emp. Form.C15H13N3O3S
Mol. Mass.315.347
SMILESCc1ccc2cccc(Oc3ccncc3S(N)(=O)=O)c2n1