Reaction Details
TargetCarbonic anhydrase 14
LigandBDBM50320519
Substrate/Competitorn/a
Meas. Tech.ChEMBL_637719 (CHEMBL1167310)
Ki 160±n/a nM
Citation Brzozowski, ZSlawinski, JSaczewski, FInnocenti, ASupuran, CT Carbonic anhydrase inhibitors: synthesis and inhibition of the human cytosolic isozymes I and II and transmembrane isozymes IX, XII (cancer-associated) and XIV with 4-substituted 3-pyridinesulfonamides. Eur J Med Chem45:2396-404 (2010) 
 
Carbonic anhydrase 14
Name:Carbonic anhydrase 14
Type:Enzyme
Mol. Mass.:37665.67
Organism:Homo sapiens (Human)
Description:Human (cloned) isozyme.
Residue:337
BDBM50320519
NameBDBM50320519
Synonyms:4,4'-thiodipyridine-3-sulfonamide | CHEMBL1164504
TypeSmall organic molecule
Emp. Form.C10H10N4O4S3
Mol. Mass.346.406
SMILESNS(=O)(=O)c1cnccc1Sc1ccncc1S(N)(=O)=O