Reaction Details
TargetCarbonic anhydrase 14
LigandBDBM50320518
Substrate/Competitorn/a
Meas. Tech.ChEMBL_637719 (CHEMBL1167310)
Ki 98.3±n/a nM
Citation Brzozowski, ZSlawinski, JSaczewski, FInnocenti, ASupuran, CT Carbonic anhydrase inhibitors: synthesis and inhibition of the human cytosolic isozymes I and II and transmembrane isozymes IX, XII (cancer-associated) and XIV with 4-substituted 3-pyridinesulfonamides. Eur J Med Chem45:2396-404 (2010) 
 
Carbonic anhydrase 14
Name:Carbonic anhydrase 14
Type:Enzyme
Mol. Mass.:37665.67
Organism:Homo sapiens (Human)
Description:Human (cloned) isozyme.
Residue:337
BDBM50320518
NameBDBM50320518
Synonyms:4-Methylthiopyridine-3-sulfonamide | CHEMBL1165117
TypeSmall organic molecule
Emp. Form.C6H8N2O2S2
Mol. Mass.204.27
SMILESCSc1ccncc1S(N)(=O)=O