Reaction Details
TargetHistone deacetylase 8
LigandBDBM19130
Substrate/Competitorn/a
Meas. Tech.ChEMBL_638011 (CHEMBL1166732)
Ki 130±n/a nM
Citation Bertrand, P Inside HDAC with HDAC inhibitors. Eur J Med Chem45:2095-116 (2010) 
 
Histone deacetylase 8
Name:Histone deacetylase 8
Type:Enzyme
Mol. Mass.:41749.60
Organism:Homo sapiens (Human)
Description:Q9BY41
Residue:377
BDBM19130
NameBDBM19130
Synonyms:(2E,4E,6R)-7-[4-(dimethylamino)phenyl]-N-hydroxy-4,6-dimethyl-7-oxohepta-2,4-dienamide TSA | Trichostatin A (TSA)
TypeSmall organic molecule
Emp. Form.C17H22N2O3
Mol. Mass.302.3682
SMILESCC(C=CC(=O)NO)C=C(C)C(=O)c1ccc(cc1)N(C)C