Reaction Details
TargetHistone deacetylase 8
LigandBDBM19427
Substrate/Competitorn/a
Meas. Tech.ChEMBL_638011 (CHEMBL1166732)
IC50>20000±n/a nM
Citation Bertrand, P Inside HDAC with HDAC inhibitors. Eur J Med Chem45:2095-116 (2010) 
 
Histone deacetylase 8
Name:Histone deacetylase 8
Type:Enzyme
Mol. Mass.:41749.60
Organism:Homo sapiens (Human)
Description:Q9BY41
Residue:377
BDBM19427
NameBDBM19427
Synonyms:N-[2-amino-5-(thiophen-2-yl)phenyl]-4-methoxybenzamide | benzamide-type inhibitor, 23
TypeSmall organic molecule
Emp. Form.C18H16N2O2S
Mol. Mass.324.397
SMILESCOc1ccc(cc1)C(=O)Nc1cc(ccc1N)-c1cccs1