Reaction Details
TargetHistone deacetylase 2
LigandBDBM50320524
Substrate/Competitorn/a
Meas. Tech.ChEMBL_638008 (CHEMBL1166729)
IC50 20±n/a nM
Citation Bertrand, P Inside HDAC with HDAC inhibitors. Eur J Med Chem45:2095-116 (2010) 
 
Histone deacetylase 2
Name:Histone deacetylase 2
Type:Chromatin regulator; hydrolase; repressor
Mol. Mass.:55356.54
Organism:Homo sapiens (Human)
Description:Q92769
Residue:488
BDBM50320524
NameBDBM50320524
Synonyms:(E)-N-(2-amino-5-(thiophen-2-yl)phenyl)-4-(2-iminoethylideneamino)benzamide | CHEMBL1164671
TypeSmall organic molecule
Emp. Form.C19H16N4OS
Mol. Mass.348.422
SMILESNc1ccc(cc1NC(=O)c1ccc(cc1)\N=C\C=N)-c1cccs1