Reaction Details
TargetHistone deacetylase 1
LigandBDBM50320524
Substrate/Competitorn/a
Meas. Tech.ChEMBL_638007 (CHEMBL1166728)
IC50 60±n/a nM
Citation Bertrand, P Inside HDAC with HDAC inhibitors. Eur J Med Chem45:2095-116 (2010) 
 
Histone deacetylase 1
Name:Histone deacetylase 1
Type:Enzyme
Mol. Mass.:55090.27
Organism:Homo sapiens (Human)
Description:Q13547
Residue:482
BDBM50320524
NameBDBM50320524
Synonyms:(E)-N-(2-amino-5-(thiophen-2-yl)phenyl)-4-(2-iminoethylideneamino)benzamide | CHEMBL1164671
TypeSmall organic molecule
Emp. Form.C19H16N4OS
Mol. Mass.348.422
SMILESNc1ccc(cc1NC(=O)c1ccc(cc1)\N=C\C=N)-c1cccs1