Reaction Details
TargetHistone deacetylase 1
LigandBDBM19427
Substrate/Competitorn/a
Meas. Tech.ChEMBL_638007 (CHEMBL1166728)
IC50 50±n/a nM
Citation Bertrand, P Inside HDAC with HDAC inhibitors. Eur J Med Chem45:2095-116 (2010) 
 
Histone deacetylase 1
Name:Histone deacetylase 1
Type:Enzyme
Mol. Mass.:55090.27
Organism:Homo sapiens (Human)
Description:Q13547
Residue:482
BDBM19427
NameBDBM19427
Synonyms:N-[2-amino-5-(thiophen-2-yl)phenyl]-4-methoxybenzamide | benzamide-type inhibitor, 23
TypeSmall organic molecule
Emp. Form.C18H16N2O2S
Mol. Mass.324.397
SMILESCOc1ccc(cc1)C(=O)Nc1cc(ccc1N)-c1cccs1