Reaction Details
TargetBeta-secretase 1
LigandBDBM50320578
Substrate/Competitorn/a
Meas. Tech.ChEMBL_638490 (CHEMBL1166257)
IC50 5±n/a nM
Citation Choi, SJCho, JHIm, ILee, SDJang, JYOh, YMJung, YKJeon, ESKim, YC Design and synthesis of 1,4-dihydropyridine derivatives as BACE-1 inhibitors. Eur J Med Chem45:2578-90 (2010) 
 
Beta-secretase 1
Name:Beta-secretase 1
Type:Protein
Mol. Mass.:55755.10
Organism:Homo sapiens (Human)
Description:P56817
Residue:501
BDBM50320578
NameBDBM50320578
Synonyms:CHEMBL1165545 | N-[(1S,2R)-1-Benzyl-2-hydroxy-3-(3-trifluoromethyl-phenylamino)-propyl]-3-(1,1-dioxo-1lambda*6*-[1,2]thiazinan-2-yl)-5-ethylamino-benzamide
TypeSmall organic molecule
Emp. Form.C30H35F3N4O4S
Mol. Mass.604.684
SMILESCCNc1cc(cc(c1)C(=O)N[C@@H](Cc1ccccc1)[C@H](O)CNc1cccc(c1)C(F)(F)F)N1CCCCS1(=O)=O