Reaction Details
TargetPolyphenol oxidase 2
LigandBDBM50304604
Substrate/Competitorn/a
Meas. Tech.ChEMBL_639017 (CHEMBL1166155)
Ki 2470±n/a nM
Citation Ghani, UUllah, N New potent inhibitors of tyrosinase: novel clues to binding of 1,3,4-thiadiazole-2(3H)-thiones, 1,3,4-oxadiazole-2(3H)-thiones, 4-amino-1,2,4-triazole-5(4H)-thiones, and substituted hydrazides to the dicopper active site. Bioorg Med Chem18:4042-8 (2010) 
 
Polyphenol oxidase 2
Name:Polyphenol oxidase 2
Type:Protein
Mol. Mass.:63923.66
Organism:Agaricus bisporus (Common mushroom)
Description:O42713
Residue:556
BDBM50304604
NameBDBM50304604
Synonyms:5-(pyridin-4-yl)-1,3,4-thiadiazole-2(3H)-thione CHEMBL596214
TypeSmall organic molecule
Emp. Form.C7H5N3S2
Mol. Mass.195.265
SMILESSc1nnc(s1)-c1ccncc1